Jump to content

Recommended Posts

Posted

Проблем с WiFi на Toshiba Satellite L500-1xw на Fedora 23

Няма инсталиран драйвер, самата безжична карта е  Rtl8192se

от сайта на Realtek изтеглих версия на драйвер за Linux rtl-92ce_se_de_linux_mac80211_0005.1230.2011
пише че е за ядро над 3.6 но за съжаление не се инсталира... дава ли че драйвера не поддържа ядро 4.3 на което съм на Федора 23.

[root@me rtl_92ce_92se_92de_linux_mac80211_0005.1230.2011]# make
make -C /lib/modules/3.1.0-7.fc16.x86_64/build M=/usr/src/rtl_92ce_92se_92de_linux_mac80211_0005.1230.2011 modules
make: *** /lib/modules/3.1.0-7.fc16.x86_64/build: No such file or directory.  Stop.
make: *** [all] Error 2

пробвал съм и други но резултата е същият...

 

  • Administrator
Posted

Редхатовски недомислия.

Инвестирай в нещо работещо

Аtheros/Intel

примерно

https://www.jmt.bg/p/8722/intel-3160hmw

https://www.jmt.bg/p/8723/intel-7260-hmwwb-r-dual-band-wireless-ac-adapter-bluetooth-hmc

 

Харесай поста ^^^
acer.gif htc.gifsigpic4024_2.gif

Форумът е за взаимопомощ а не за свършване на чужда работа

RB951Ui-2HnD / RBD25GR-5HPACQD2HPND&R11E-LTE6 /  RB952Ui-5ac2nD-TC


ɹɐǝɥ uɐɔ noʎ ǝɹoɯ ǝɥʇ 'ǝɯoɔǝq noʎ ɹǝʇǝınb ǝɥʇ

Posted

Много добра идея :)
Но е за служебна машина и не мога да си позволя каквито и да е хардуерни промени.
Интересно, че при инсталация на предходните Федори 14 и 15 е тръгвала безжичната още със самата инсталация.
И си мисля да инсталирам 15 и после да Update-вам до 23 :(:(:( което е убийствено

Posted

пробвам с поредната версия на драйвер за същата безжична карта... забравил съм да уточня че Fedora 23 e 64-bit

и пак ми дава куп грешки:

[root@МЕ rtl_92ce_92se_92de_8723ae_linux_mac80211_0007.0809.2012]# make
make -C /lib/modules/4.4.6-300.fc23.x86_64/build M=/home/varna/Downloads/RTL_92se/rtl_92ce_92se_92de_8723ae_linux_mac80211_0007.0809.2012 modules
make[1]: Entering directory '/usr/src/kernels/4.4.6-300.fc23.x86_64'
  CC [M]  /home/varna/Downloads/RTL_92se/rtl_92ce_92se_92de_8723ae_linux_mac80211_0007.0809.2012/base.o
In file included from /home/varna/Downloads/RTL_92se/rtl_92ce_92se_92de_8723ae_linux_mac80211_0007.0809.2012/base.c:39:0:
/home/varna/Downloads/RTL_92se/rtl_92ce_92se_92de_8723ae_linux_mac80211_0007.0809.2012/pci.h:245:15: error: expected ‘=’, ‘,’, ‘;’, ‘asm’ or ‘__attribute__’ before ‘rtl_pci_probe’
 int __devinit rtl_pci_probe(struct pci_dev *pdev,
               ^
/home/varna/Downloads/RTL_92se/rtl_92ce_92se_92de_8723ae_linux_mac80211_0007.0809.2012/base.c: In function ‘_rtl_init_mac80211’:
/home/varna/Downloads/RTL_92se/rtl_92ce_92se_92de_8723ae_linux_mac80211_0007.0809.2012/base.c:318:12: error: assignment to expression with array type
  hw->flags = IEEE80211_HW_SIGNAL_DBM |
            ^
/home/varna/Downloads/RTL_92se/rtl_92ce_92se_92de_8723ae_linux_mac80211_0007.0809.2012/base.c:331:13: error: assignment to expression with array type
   hw->flags |= IEEE80211_HW_SUPPORTS_PS |
             ^
/home/varna/Downloads/RTL_92se/rtl_92ce_92se_92de_8723ae_linux_mac80211_0007.0809.2012/base.c:353:4: error: ‘struct ieee80211_hw’ has no member named ‘channel_change_time’
  hw->channel_change_time = 100;
    ^
/home/varna/Downloads/RTL_92se/rtl_92ce_92se_92de_8723ae_linux_mac80211_0007.0809.2012/base.c: In function ‘rtl_action_proc’:
/home/varna/Downloads/RTL_92se/rtl_92ce_92se_92de_8723ae_linux_mac80211_0007.0809.2012/base.c:869:32: error: ‘struct ieee80211_conf’ has no member named ‘channel’
       rx_status.freq = hw->conf.channel->center_freq;
                                ^
/home/varna/Downloads/RTL_92se/rtl_92ce_92se_92de_8723ae_linux_mac80211_0007.0809.2012/base.c:870:32: error: ‘struct ieee80211_conf’ has no member named ‘channel’
       rx_status.band = hw->conf.channel->band;
                                ^
/home/varna/Downloads/RTL_92se/rtl_92ce_92se_92de_8723ae_linux_mac80211_0007.0809.2012/base.c:872:25: error: ‘RX_FLAG_MACTIME_MPDU’ undeclared (first use in this function)
       rx_status.flag |= RX_FLAG_MACTIME_MPDU;
                         ^
/home/varna/Downloads/RTL_92se/rtl_92ce_92se_92de_8723ae_linux_mac80211_0007.0809.2012/base.c:872:25: note: each undeclared identifier is reported only once for each function it appears in
/home/varna/Downloads/RTL_92se/rtl_92ce_92se_92de_8723ae_linux_mac80211_0007.0809.2012/base.c: In function ‘rtl_beacon_statistic’:
/home/varna/Downloads/RTL_92se/rtl_92ce_92se_92de_8723ae_linux_mac80211_0007.0809.2012/base.c:1143:6: error: implicit declaration of function ‘compare_ether_addr’ [-Werror=implicit-function-declaration]
  if (compare_ether_addr(hdr->addr3, rtlpriv->mac80211.bssid))
      ^
/home/varna/Downloads/RTL_92se/rtl_92ce_92se_92de_8723ae_linux_mac80211_0007.0809.2012/base.c: In function ‘rtl_send_smps_action’:
/home/varna/Downloads/RTL_92se/rtl_92ce_92se_92de_8723ae_linux_mac80211_0007.0809.2012/base.c:1434:16: error: ‘struct <anonymous>’ has no member named ‘sta’
   info->control.sta = sta;
                ^
/home/varna/Downloads/RTL_92se/rtl_92ce_92se_92de_8723ae_linux_mac80211_0007.0809.2012/base.c:1435:24: error: ‘struct ieee80211_conf’ has no member named ‘channel’
   info->band = hw->conf.channel->band;
                        ^
/home/varna/Downloads/RTL_92se/rtl_92ce_92se_92de_8723ae_linux_mac80211_0007.0809.2012/base.c: In function ‘rtl_store_debug_level’:
/home/varna/Downloads/RTL_92se/rtl_92ce_92se_92de_8723ae_linux_mac80211_0007.0809.2012/base.c:1659:8: error: implicit declaration of function ‘strict_strtoul’ [-Werror=implicit-function-declaration]
  ret = strict_strtoul(buf, 0, &val);
        ^
cc1: some warnings being treated as errors
scripts/Makefile.build:258: recipe for target '/home/varna/Downloads/RTL_92se/rtl_92ce_92se_92de_8723ae_linux_mac80211_0007.0809.2012/base.o' failed
make[2]: *** [/home/varna/Downloads/RTL_92se/rtl_92ce_92se_92de_8723ae_linux_mac80211_0007.0809.2012/base.o] Error 1
Makefile:1388: recipe for target '_module_/home/varna/Downloads/RTL_92se/rtl_92ce_92se_92de_8723ae_linux_mac80211_0007.0809.2012' failed
make[1]: *** [_module_/home/varna/Downloads/RTL_92se/rtl_92ce_92se_92de_8723ae_linux_mac80211_0007.0809.2012] Error 2
make[1]: Leaving directory '/usr/src/kernels/4.4.6-300.fc23.x86_64'
Makefile:27: recipe for target 'all' failed
make: *** [all] Error 2

........

 

Posted

пробвам с поредната версия на драйвер за същата безжична карта... забравил съм да уточня че Fedora 23 e 64-bit

и пак ми дава куп грешки:

[root@МЕ rtl_92ce_92se_92de_8723ae_linux_mac80211_0007.0809.2012]# make
make -C /lib/modules/4.4.6-300.fc23.x86_64/build M=/home/varna/Downloads/RTL_92se/rtl_92ce_92se_92de_8723ae_linux_mac80211_0007.0809.2012 modules
make[1]: Entering directory '/usr/src/kernels/4.4.6-300.fc23.x86_64'
  CC [M]  /home/varna/Downloads/RTL_92se/rtl_92ce_92se_92de_8723ae_linux_mac80211_0007.0809.2012/base.o
In file included from /home/varna/Downloads/RTL_92se/rtl_92ce_92se_92de_8723ae_linux_mac80211_0007.0809.2012/base.c:39:0:
/home/varna/Downloads/RTL_92se/rtl_92ce_92se_92de_8723ae_linux_mac80211_0007.0809.2012/pci.h:245:15: error: expected ‘=’, ‘,’, ‘;’, ‘asm’ or ‘__attribute__’ before ‘rtl_pci_probe’
 int __devinit rtl_pci_probe(struct pci_dev *pdev,
               ^
/home/varna/Downloads/RTL_92se/rtl_92ce_92se_92de_8723ae_linux_mac80211_0007.0809.2012/base.c: In function ‘_rtl_init_mac80211’:
/home/varna/Downloads/RTL_92se/rtl_92ce_92se_92de_8723ae_linux_mac80211_0007.0809.2012/base.c:318:12: error: assignment to expression with array type
  hw->flags = IEEE80211_HW_SIGNAL_DBM |
            ^
/home/varna/Downloads/RTL_92se/rtl_92ce_92se_92de_8723ae_linux_mac80211_0007.0809.2012/base.c:331:13: error: assignment to expression with array type
   hw->flags |= IEEE80211_HW_SUPPORTS_PS |
             ^
/home/varna/Downloads/RTL_92se/rtl_92ce_92se_92de_8723ae_linux_mac80211_0007.0809.2012/base.c:353:4: error: ‘struct ieee80211_hw’ has no member named ‘channel_change_time’
  hw->channel_change_time = 100;
    ^
/home/varna/Downloads/RTL_92se/rtl_92ce_92se_92de_8723ae_linux_mac80211_0007.0809.2012/base.c: In function ‘rtl_action_proc’:
/home/varna/Downloads/RTL_92se/rtl_92ce_92se_92de_8723ae_linux_mac80211_0007.0809.2012/base.c:869:32: error: ‘struct ieee80211_conf’ has no member named ‘channel’
       rx_status.freq = hw->conf.channel->center_freq;
                                ^
/home/varna/Downloads/RTL_92se/rtl_92ce_92se_92de_8723ae_linux_mac80211_0007.0809.2012/base.c:870:32: error: ‘struct ieee80211_conf’ has no member named ‘channel’
       rx_status.band = hw->conf.channel->band;
                                ^
/home/varna/Downloads/RTL_92se/rtl_92ce_92se_92de_8723ae_linux_mac80211_0007.0809.2012/base.c:872:25: error: ‘RX_FLAG_MACTIME_MPDU’ undeclared (first use in this function)
       rx_status.flag |= RX_FLAG_MACTIME_MPDU;
                         ^
/home/varna/Downloads/RTL_92se/rtl_92ce_92se_92de_8723ae_linux_mac80211_0007.0809.2012/base.c:872:25: note: each undeclared identifier is reported only once for each function it appears in
/home/varna/Downloads/RTL_92se/rtl_92ce_92se_92de_8723ae_linux_mac80211_0007.0809.2012/base.c: In function ‘rtl_beacon_statistic’:
/home/varna/Downloads/RTL_92se/rtl_92ce_92se_92de_8723ae_linux_mac80211_0007.0809.2012/base.c:1143:6: error: implicit declaration of function ‘compare_ether_addr’ [-Werror=implicit-function-declaration]
  if (compare_ether_addr(hdr->addr3, rtlpriv->mac80211.bssid))
      ^
/home/varna/Downloads/RTL_92se/rtl_92ce_92se_92de_8723ae_linux_mac80211_0007.0809.2012/base.c: In function ‘rtl_send_smps_action’:
/home/varna/Downloads/RTL_92se/rtl_92ce_92se_92de_8723ae_linux_mac80211_0007.0809.2012/base.c:1434:16: error: ‘struct <anonymous>’ has no member named ‘sta’
   info->control.sta = sta;
                ^
/home/varna/Downloads/RTL_92se/rtl_92ce_92se_92de_8723ae_linux_mac80211_0007.0809.2012/base.c:1435:24: error: ‘struct ieee80211_conf’ has no member named ‘channel’
   info->band = hw->conf.channel->band;
                        ^
/home/varna/Downloads/RTL_92se/rtl_92ce_92se_92de_8723ae_linux_mac80211_0007.0809.2012/base.c: In function ‘rtl_store_debug_level’:
/home/varna/Downloads/RTL_92se/rtl_92ce_92se_92de_8723ae_linux_mac80211_0007.0809.2012/base.c:1659:8: error: implicit declaration of function ‘strict_strtoul’ [-Werror=implicit-function-declaration]
  ret = strict_strtoul(buf, 0, &val);
        ^
cc1: some warnings being treated as errors
scripts/Makefile.build:258: recipe for target '/home/varna/Downloads/RTL_92se/rtl_92ce_92se_92de_8723ae_linux_mac80211_0007.0809.2012/base.o' failed
make[2]: *** [/home/varna/Downloads/RTL_92se/rtl_92ce_92se_92de_8723ae_linux_mac80211_0007.0809.2012/base.o] Error 1
Makefile:1388: recipe for target '_module_/home/varna/Downloads/RTL_92se/rtl_92ce_92se_92de_8723ae_linux_mac80211_0007.0809.2012' failed
make[1]: *** [_module_/home/varna/Downloads/RTL_92se/rtl_92ce_92se_92de_8723ae_linux_mac80211_0007.0809.2012] Error 2
make[1]: Leaving directory '/usr/src/kernels/4.4.6-300.fc23.x86_64'
Makefile:27: recipe for target 'all' failed
make: *** [all] Error 2

........

 

  • Administrator
Posted

Има и по читаво решение за служебни вярно губиш един порт но 

https://www.jmt.bg/p/13251/tp-link-archer-t1u

https://wikidevi.com/wiki/TP-LINK_TL-WDN5200

Харесай поста ^^^
acer.gif htc.gifsigpic4024_2.gif

Форумът е за взаимопомощ а не за свършване на чужда работа

RB951Ui-2HnD / RBD25GR-5HPACQD2HPND&R11E-LTE6 /  RB952Ui-5ac2nD-TC


ɹɐǝɥ uɐɔ noʎ ǝɹoɯ ǝɥʇ 'ǝɯoɔǝq noʎ ɹǝʇǝınb ǝɥʇ

Posted

Дръпни си тази версия https://github.com/chunkeey/rtl8192su и тествай с нея. Преди това си изпълнил това, нали? - yum groupinstall development-tools

Модулът, който реално търсиш е rtl8192se.ko (би трябвало да присъства в пакета kernel-modules ).

  • Administrator
Posted

yum install kernel-headers kernel-devel gcc make

Use since

OpenBSD 3.x

FreeBSD 4.x

Centos 5.x Debian 3.x Ubuntu 7.x

Аз съм фен на OpenWRT.

 

Горчивината от лошото качество остава дълго след като е преминало удоволствието от ниската цена.

_____________________________

___|____|____|____|____|____|__

_|____|____|____|____|____|____

___|____|_ Удряй _|____|____|__

_|____|___ главата ___|____|____

___|____|_ си тук!! |____|____|__

_|____|____|____|____|____|____

___|____|____|____|____|____|__

Posted

Благодаря колеги за съдействието.
ДА изпълнил съм:
yum groupinstall development-tools
и
yum install kernel-headers kernel-devel gcc make

На колегата hgd
Лични благодарности.
изтеглих дози пакет, в интерес на истината това е единственият драйвер на който МАКЕ му минава с няколко
 warning-га

но след това Make Load орново дава грешка:

[root@fedora rtl8192su-master]# make load
modprobe mac80211
insmod /home/varna/Downloads/RTL_92se/rtl8192su-master/rtlwifi/rtlwifi.ko
insmod: ERROR: could not insert module /home/varna/Downloads/RTL_92se/rtl8192su-master/rtlwifi/rtlwifi.ko: File exists
Makefile:30: recipe for target 'load' failed
make: *** [load] Error 1

И съм пак на изходна позиция.

  • Administrator
Posted

Преименувай стария фаел 

Харесай поста ^^^
acer.gif htc.gifsigpic4024_2.gif

Форумът е за взаимопомощ а не за свършване на чужда работа

RB951Ui-2HnD / RBD25GR-5HPACQD2HPND&R11E-LTE6 /  RB952Ui-5ac2nD-TC


ɹɐǝɥ uɐɔ noʎ ǝɹoɯ ǝɥʇ 'ǝɯoɔǝq noʎ ɹǝʇǝınb ǝɥʇ

Posted

Какво имаш предвид под Стария файл?
инсталацията не може да се преименува преди МАКЕ ...

  • Administrator
Posted

Лога казва че вече има такъв и неможе да го презапише 

File exists

вероятно заради правата

Харесай поста ^^^
acer.gif htc.gifsigpic4024_2.gif

Форумът е за взаимопомощ а не за свършване на чужда работа

RB951Ui-2HnD / RBD25GR-5HPACQD2HPND&R11E-LTE6 /  RB952Ui-5ac2nD-TC


ɹɐǝɥ uɐɔ noʎ ǝɹoɯ ǝɥʇ 'ǝɯoɔǝq noʎ ɹǝʇǝınb ǝɥʇ

Posted

Всичко се стартира с root права.
Нямам в състемата друг файл

rtlwifi.ko

Освен този от инсталацията.

 

 

Posted

Защо не направиш един "make install" и след това не рестартираш?

Разбира се, "modprobe -r rtlwifi" и след това "make load" трябва да работи, докато не рестартираш.

Create an account or sign in to comment

You need to be a member in order to leave a comment

Create an account

Sign up for a new account in our community. It's easy!

Register a new account

Sign in

Already have an account? Sign in here.

Sign In Now
  • Recently Browsing   0 members

    • No registered users viewing this page.
×
×
  • Create New...

Important Information

By using this site, you agree to our Terms of Use.